{"text_format":"2","workbook":"xlsx","n_sheets":10,"sheets":["Sichtfeld","Bewegung 1D","Mathematik","Diagramme Bildfeld","Diagramme Modulbreite","Schärfentiefe","Daten Gesamt","IDC Sichtfeldrechner","IDC FoV Calculator English","Kalkulator"],"not_rendered":{"charts":14,"images":8,"macros":1,"external_links":0,"defined_names":0,"comments":6,"pivot_tables":0},"unopened":[],"bounds":{"document_bytes":16777216,"sheet_cells":100000,"run_cost":"one","rows_first":2000,"rows_last":500,"rows_between":2000,"halvings":0,"cell_chars":16384,"cell_head_chars":4096},"cells_cut":0,"cells_raw":0,"read":"whole","date_system":"1900"}

{"sheet":"Sichtfeld","index":0,"n_rows":284,"n_cols":25,"rows_kept":284,"cut":false,"hidden":true,"merged":[[9,18,9,24],[10,18,10,24],[11,18,11,24],[12,18,12,24],[9,2,9,8],[10,2,10,8],[11,2,11,8],[12,2,12,8],[9,10,9,16],[10,10,10,16],[11,10,11,16],[12,10,12,16],[226,5,226,6],[226,13,226,14],[226,21,226,22],[21,23,21,24],[21,5,21,6],[21,13,21,14],[21,21,21,22],[21,7,21,8],[21,15,21,16]]}
["Bildbreite [px]",null,1280]
["Bildhöhe [px]",null,800]
["Pixelgröße [µm]",null,3]
["Abstand Gehäusefront zu Sensor [mm]",null,34]
["Sensorbreite [mm]",null,{"$f":"$C$3/1000*C1","v":3.84}]
["Sensorhöhe [mm]",null,{"$f":"$C$3/1000*C2","v":2.4}]
["Min. Breite Modul 1D-Code [px]",null,1.5]
["Min. Breite Modul 2D-Code [px]",null,3]
[]
["Hersteller",null,"YTOT",{"$nulls":7},"YTOT",{"$nulls":7},"EVETAR"]
["Objektiv",null,"YT1028-2MP",{"$nulls":7},"YT10051-2MP",{"$nulls":7},"M13B1618IRM12R1"]
["Daten allg.",null,"\\\\emea.baumernet.org\\de04d\\Projekte\\34600180_Plattform_Stage_3\\3_kon\\01_Optik\\3_Objektive_YTOT\\Datenblätter\\YT1028-2MP.pdf",{"$nulls":7},"\\\\emea.baumernet.org\\de04d\\Projekte\\34600180_Plattform_Stage_3\\3_kon\\01_Optik\\3_Objektive_YTOT\\Datenblätter\\YT10051-2MP.pdf",{"$nulls":7}," "]
["Daten H1/H2",null,"\\\\emea.baumernet.org\\de04d\\Projekte\\34600180_Plattform_Stage_3\\3_kon\\01_Optik\\3_Objektive_YTOT\\Datenblätter\\YT10028_H1H2.pdf",{"$nulls":7},"\\\\emea.baumernet.org\\de04d\\Projekte\\34600180_Plattform_Stage_3\\3_kon\\01_Optik\\3_Objektive_YTOT\\Datenblätter\\YT10051_H1H2.pdf",{"$nulls":7},"\\\\emea.baumernet.org\\de04d\\Projekte\\34600180_Plattform_Stage_3\\3_kon\\01_Optik\\2_Objektive_Evetar\\Datenblätter\\16mmF1,8_11162414.pdf"]
["Brennweite f [mm]",null,6,{"$nulls":7},8,{"$nulls":7},16]
["Hauptebene 1 [mm]",null,{"$f":"C$17-5.63-7.55","v":9.02},{"$nulls":7},{"$f":"K$17-4.9-9.02","v":8.2799999999999976},{"$nulls":7},{"$f":"S$17-16.29","v":5.8500000000000014}]
["Hauptebene 2 [mm]",null,{"$f":"C$17-5.63-0.2","v":16.37},{"$nulls":7},{"$f":"K$17-4.9-3.19","v":14.109999999999998},{"$nulls":7},{"$f":"9.17+0.5","v":9.67}]
["Bildebene [mm]",null,22.2,{"$nulls":7},22.2,{"$nulls":7},{"$f":"15.8+6.34","v":22.14}]
["Position Front Objektiv bei unendlich",null,{"$f":"C17","v":22.2},{"$nulls":7},{"$f":"K17","v":22.2},{"$nulls":7},{"$f":"S17","v":22.14}]
["Abstand Gehäusefront zu H1 bei unendlich => g_i [mm]",null,{"$f":"$C$4-C17+C15","v":20.82},{"$nulls":7},{"$f":"$C$4-K17+K15","v":20.079999999999998},{"$nulls":7},{"$f":"$C$4-S17+S15","v":17.71}]
["x_max [mm]",null,2.6,{"$nulls":7},2.6,{"$nulls":7},2.6]
{"$rows_left_out":265}
{"sheet":"Bewegung 1D","index":1,"n_rows":119,"n_cols":13,"rows_kept":119,"cut":false,"hidden":true,"merged":[]}
["Belichtungszeit [µs]",100,null,null,"Bewegung [Modul]","Kontrast"]
["Maximale Bewegung [Modul]",0.7,null,null,0,1]
[{"$nulls":4},{"$f":"E2+0.1","v":0.1},0.99199999999999999]
[{"$nulls":4},{"$f":"E3+0.1","v":0.2},0.97599999999999998]
[{"$nulls":4},0.30000000000000004,0.95499999999999996]
[{"$nulls":4},0.4,0.92700000000000005]
[{"$nulls":4},0.5,0.89200000000000002]
[{"$nulls":4},0.6,0.85099999999999998]
[{"$nulls":4},0.7,0.80400000000000005]
[{"$nulls":4},0.79999999999999993,0.75]
[{"$nulls":4},0.89999999999999991,0.69]
[{"$nulls":4},0.99999999999999989,0.623]
[]
[null,null,null,{"$f":"Sichtfeld!C10","v":"YTOT"},null,null,null,{"$f":"Sichtfeld!K10","v":"YTOT"},null,null,null,{"$f":"Sichtfeld!S10","v":"EVETAR"}]
[null,null,null,{"$f":"Sichtfeld!C11","v":"YT1028-2MP"},null,null,null,{"$f":"Sichtfeld!K11","v":"YT10051-2MP"},null,null,null,{"$f":"Sichtfeld!S11","v":"M13B1618IRM12R1"}]
[]
[null,null,null,{"$f":"Sichtfeld!H22","v":"Mindestbreite Modul [µm]"},null,null,null,{"$f":"Sichtfeld!P22","v":"Mindestbreite Modul [µm]"},null,null,null,{"$f":"Sichtfeld!X22","v":"Mindestbreite Modul [µm]"}]
[{"$f":"Sichtfeld!A23","v":"Nutzabstand g_a [mm]"},null,null,{"$f":"Sichtfeld!H23","v":"1D-Code"},"v_max [m/s]",null,null,{"$f":"Sichtfeld!P23","v":"1D-Code"},"v_max [m/s]",null,null,{"$f":"Sichtfeld!X23","v":"1D-Code"},"v_max [m/s]"]
[{"$f":"Sichtfeld!A24","v":0},null,null,{"$f":"Sichtfeld!H24","v":""},null,null,null,{"$f":"Sichtfeld!P24","v":""},null,null,null,{"$f":"Sichtfeld!X24","v":""}]
[{"$f":"Sichtfeld!A25","v":10},{"$nulls":10},{"$f":"Sichtfeld!X25","v":""}]
{"$rows_left_out":100}
{"sheet":"Mathematik","index":2,"n_rows":0,"n_cols":0,"rows_kept":0,"cut":false,"hidden":true,"merged":[]}

{"sheet":"Diagramme Bildfeld","index":3,"n_rows":113,"n_cols":16,"rows_kept":113,"cut":false,"hidden":true,"merged":[]}
["6 mm",{"$nulls":8},"An Stelle Originalbeschriftung Diagramm:"]
[null,"Arbeitsabstand, Bildfeldgröße",{"$nulls":7},"Sichtfeld / Field of view"]
[]
[null,"Nutzabstand","Bildfeld x in mm","Bildfeld y in mm",null,"Bildfeld",null,1.6]
[null,50,{"$f":"ROUND(VLOOKUP(B5,Sichtfeld!$A$29:$Y$124,6,FALSE),0)","v":41},{"$f":"ROUND(VLOOKUP(B5,Sichtfeld!$A$29:$Y$124,7,FALSE),0)","v":26},null,{"$f":"CONCATENATE(C5,\" mm x \",D5, \" mm\")","v":"41 mm x 26 mm"},null,null,null,{"$f":"CONCATENATE(G6,\" mm x \",H6,\" mm\")","v":"650 mm x 406 mm"}]
[null,60,{"$f":"ROUND(VLOOKUP(B6,Sichtfeld!$A$29:$Y$124,6,FALSE),0)","v":48},{"$f":"ROUND(VLOOKUP(B6,Sichtfeld!$A$29:$Y$124,7,FALSE),0)","v":30},null,{"$f":"CONCATENATE(C6,\" mm x \",D6, \" mm\")","v":"48 mm x 30 mm"},650,{"$f":"ROUND(G6/$H$4,0)","v":406}]
[null,70,{"$f":"ROUND(VLOOKUP(B7,Sichtfeld!$A$29:$Y$124,6,FALSE),0)","v":54},{"$f":"ROUND(VLOOKUP(B7,Sichtfeld!$A$29:$Y$124,7,FALSE),0)","v":34},null,"54 mm x 34 mm",null,null,null,{"$f":"CONCATENATE(G8,\" mm x \",H8,\" mm\")","v":"600 mm x 375 mm"}]
[null,80,{"$f":"ROUND(VLOOKUP(B8,Sichtfeld!$A$29:$Y$124,6,FALSE),0)","v":60},{"$f":"ROUND(VLOOKUP(B8,Sichtfeld!$A$29:$Y$124,7,FALSE),0)","v":38},null,"60 mm x 38 mm",600,{"$f":"ROUND(G8/$H$4,0)","v":375}]
[null,90,{"$f":"ROUND(VLOOKUP(B9,Sichtfeld!$A$29:$Y$124,6,FALSE),0)","v":67},{"$f":"ROUND(VLOOKUP(B9,Sichtfeld!$A$29:$Y$124,7,FALSE),0)","v":42},null,"67 mm x 42 mm",null,null,null,{"$f":"CONCATENATE(G10,\" mm x \",H10,\" mm\")","v":"550 mm x 344 mm"}]
[null,100,{"$f":"ROUND(VLOOKUP(B10,Sichtfeld!$A$29:$Y$124,6,FALSE),0)","v":73},{"$f":"ROUND(VLOOKUP(B10,Sichtfeld!$A$29:$Y$124,7,FALSE),0)","v":46},null,"73 mm x 46 mm",550,{"$f":"ROUND(G10/$H$4,0)","v":344}]
[null,110,{"$f":"ROUND(VLOOKUP(B11,Sichtfeld!$A$29:$Y$124,6,FALSE),0)","v":80},{"$f":"ROUND(VLOOKUP(B11,Sichtfeld!$A$29:$Y$124,7,FALSE),0)","v":50},null,"80 mm x 50 mm",null,null,null,{"$f":"CONCATENATE(G13,\" mm x \",H13,\" mm\")","v":"500 mm x 313 mm"}]
[null,120,{"$f":"ROUND(VLOOKUP(B12,Sichtfeld!$A$29:$Y$124,6,FALSE),0)","v":86},{"$f":"ROUND(VLOOKUP(B12,Sichtfeld!$A$29:$Y$124,7,FALSE),0)","v":54},null,"86 mm x 54 mm"]
[null,130,{"$f":"ROUND(VLOOKUP(B13,Sichtfeld!$A$29:$Y$124,6,FALSE),0)","v":93},{"$f":"ROUND(VLOOKUP(B13,Sichtfeld!$A$29:$Y$124,7,FALSE),0)","v":58},null,"93 mm x 58 mm",500,{"$f":"ROUND(G13/$H$4,0)","v":313},null,{"$f":"CONCATENATE(G15,\" mm x \",H15,\" mm\")","v":"450 mm x 281 mm"}]
[null,140,{"$f":"ROUND(VLOOKUP(B14,Sichtfeld!$A$29:$Y$124,6,FALSE),0)","v":99},{"$f":"ROUND(VLOOKUP(B14,Sichtfeld!$A$29:$Y$124,7,FALSE),0)","v":62},null,"99 mm x 62 mm"]
[null,150,{"$f":"ROUND(VLOOKUP(B15,Sichtfeld!$A$29:$Y$124,6,FALSE),0)","v":105},{"$f":"ROUND(VLOOKUP(B15,Sichtfeld!$A$29:$Y$124,7,FALSE),0)","v":66},null,"105 mm x 66 mm",450,{"$f":"ROUND(G15/$H$4,0)","v":281}]
[null,160,{"$f":"ROUND(VLOOKUP(B16,Sichtfeld!$A$29:$Y$124,6,FALSE),0)","v":112},{"$f":"ROUND(VLOOKUP(B16,Sichtfeld!$A$29:$Y$124,7,FALSE),0)","v":70},null,"112 mm x 70 mm",null,null,null,{"$f":"CONCATENATE(G17,\" mm x \",H17,\" mm\")","v":"400 mm x 250 mm"}]
[null,170,{"$f":"ROUND(VLOOKUP(B17,Sichtfeld!$A$29:$Y$124,6,FALSE),0)","v":118},{"$f":"ROUND(VLOOKUP(B17,Sichtfeld!$A$29:$Y$124,7,FALSE),0)","v":74},null,"118 mm x 74 mm",400,{"$f":"ROUND(G17/$H$4,0)","v":250}]
[null,180,{"$f":"ROUND(VLOOKUP(B18,Sichtfeld!$A$29:$Y$124,6,FALSE),0)","v":125},{"$f":"ROUND(VLOOKUP(B18,Sichtfeld!$A$29:$Y$124,7,FALSE),0)","v":78},null,"125 mm x 78 mm"]
[null,190,{"$f":"ROUND(VLOOKUP(B19,Sichtfeld!$A$29:$Y$124,6,FALSE),0)","v":131},{"$f":"ROUND(VLOOKUP(B19,Sichtfeld!$A$29:$Y$124,7,FALSE),0)","v":82},null,"131 mm x 82 mm",null,null,null,{"$f":"CONCATENATE(G20,\" mm x \",H20,\" mm\")","v":"350 mm x 219 mm"}]
[null,200,{"$f":"ROUND(VLOOKUP(B20,Sichtfeld!$A$29:$Y$124,6,FALSE),0)","v":137},{"$f":"ROUND(VLOOKUP(B20,Sichtfeld!$A$29:$Y$124,7,FALSE),0)","v":86},null,"137 mm x 86 mm",350,{"$f":"ROUND(G20/$H$4,0)","v":219}]
{"$rows_left_out":94}
{"sheet":"Diagramme Modulbreite","index":4,"n_rows":113,"n_cols":13,"rows_kept":113,"cut":false,"hidden":true,"merged":[]}
["6 mm",{"$nulls":5},"Modulbreite [mm]",null,"\"Die Diagramme dienen zur Orientierung. Maßgeblich sind Tests mit dem Produkt unter Berücksichtigung von Codetyp, Codequalität und verwendetem Parameterset.\""]
[null,"Arbeitsabstand, Modulgröße",null,"Hinweis: Größenreserve",null,"1 mm =","Module width [mm]",null,"\"The diagrams are for guidance. Decisive are tests with the product under consideration of code type, code quality and used parameter set.\""]
[{"$nulls":5},39.370100000000001]
[null,"Nutzabstand","Mindestbreite Modul 1D [µm]","Mindestbreite Modul 2D [µm]",null,"Mindestbreite Modul 1D [mil]","Mindestbreite Modul 2D [µm]"]
[null,50,{"$f":"ROUND((0.001*VLOOKUP(B5,Sichtfeld!$A$29:$Y$124,8,FALSE)),3)","v":4.8000000000000001E-2},{"$f":"ROUND((0.001*VLOOKUP(B5,Sichtfeld!$A$29:$Y$124,9,FALSE)),3)","v":9.6000000000000002E-2},null,{"$f":"C5*$F$3","v":1.8897648},{"$f":"D5*$F$3","v":3.7795296}]
[null,60,{"$f":"ROUND((0.001*VLOOKUP(B6,Sichtfeld!$A$29:$Y$124,8,FALSE)),3)","v":5.6000000000000001E-2},{"$f":"ROUND((0.001*VLOOKUP(B6,Sichtfeld!$A$29:$Y$124,9,FALSE)),3)","v":0.112},null,{"$f":"C6*$F$3","v":2.2047256000000002},4.4094512000000003]
[null,70,{"$f":"ROUND((0.001*VLOOKUP(B7,Sichtfeld!$A$29:$Y$124,8,FALSE)),3)","v":6.3E-2},{"$f":"ROUND((0.001*VLOOKUP(B7,Sichtfeld!$A$29:$Y$124,9,FALSE)),3)","v":0.127},null,2.4803163000000001,5.0000027000000005]
[null,80,{"$f":"ROUND((0.001*VLOOKUP(B8,Sichtfeld!$A$29:$Y$124,8,FALSE)),3)","v":7.0999999999999994E-2},{"$f":"ROUND((0.001*VLOOKUP(B8,Sichtfeld!$A$29:$Y$124,9,FALSE)),3)","v":0.14199999999999999},null,2.7952770999999998,5.5905541999999997]
[null,90,{"$f":"ROUND((0.001*VLOOKUP(B9,Sichtfeld!$A$29:$Y$124,8,FALSE)),3)","v":7.8E-2},{"$f":"ROUND((0.001*VLOOKUP(B9,Sichtfeld!$A$29:$Y$124,9,FALSE)),3)","v":0.157},null,3.0708678000000003,6.1811056999999998]
[null,100,{"$f":"ROUND((0.001*VLOOKUP(B10,Sichtfeld!$A$29:$Y$124,8,FALSE)),3)","v":8.5999999999999993E-2},{"$f":"ROUND((0.001*VLOOKUP(B10,Sichtfeld!$A$29:$Y$124,9,FALSE)),3)","v":0.17199999999999999},null,3.3858286,6.7716571999999999]
[null,110,{"$f":"ROUND((0.001*VLOOKUP(B11,Sichtfeld!$A$29:$Y$124,8,FALSE)),3)","v":9.2999999999999999E-2},{"$f":"ROUND((0.001*VLOOKUP(B11,Sichtfeld!$A$29:$Y$124,9,FALSE)),3)","v":0.187},null,3.6614192999999999,7.3622087000000001]
[null,120,{"$f":"ROUND((0.001*VLOOKUP(B12,Sichtfeld!$A$29:$Y$124,8,FALSE)),3)","v":0.10100000000000001},{"$f":"ROUND((0.001*VLOOKUP(B12,Sichtfeld!$A$29:$Y$124,9,FALSE)),3)","v":0.20200000000000001},null,3.9763801000000005,7.9527602000000011]
[null,130,{"$f":"ROUND((0.001*VLOOKUP(B13,Sichtfeld!$A$29:$Y$124,8,FALSE)),3)","v":0.108},{"$f":"ROUND((0.001*VLOOKUP(B13,Sichtfeld!$A$29:$Y$124,9,FALSE)),3)","v":0.217},null,4.2519707999999996,8.5433117000000003]
[null,140,{"$f":"ROUND((0.001*VLOOKUP(B14,Sichtfeld!$A$29:$Y$124,8,FALSE)),3)","v":0.11600000000000001},{"$f":"ROUND((0.001*VLOOKUP(B14,Sichtfeld!$A$29:$Y$124,9,FALSE)),3)","v":0.23200000000000001},null,4.5669316000000002,9.1338632000000004]
[null,150,{"$f":"ROUND((0.001*VLOOKUP(B15,Sichtfeld!$A$29:$Y$124,8,FALSE)),3)","v":0.123},{"$f":"ROUND((0.001*VLOOKUP(B15,Sichtfeld!$A$29:$Y$124,9,FALSE)),3)","v":0.247},null,4.8425222999999997,9.7244147000000005]
[null,160,{"$f":"ROUND((0.001*VLOOKUP(B16,Sichtfeld!$A$29:$Y$124,8,FALSE)),3)","v":0.13100000000000001},{"$f":"ROUND((0.001*VLOOKUP(B16,Sichtfeld!$A$29:$Y$124,9,FALSE)),3)","v":0.26200000000000001},null,5.1574831000000003,10.314966200000001]
[null,170,{"$f":"ROUND((0.001*VLOOKUP(B17,Sichtfeld!$A$29:$Y$124,8,FALSE)),3)","v":0.13800000000000001},{"$f":"ROUND((0.001*VLOOKUP(B17,Sichtfeld!$A$29:$Y$124,9,FALSE)),3)","v":0.27700000000000002},null,5.4330738000000007,10.905517700000001]
[null,180,{"$f":"ROUND((0.001*VLOOKUP(B18,Sichtfeld!$A$29:$Y$124,8,FALSE)),3)","v":0.14599999999999999},{"$f":"ROUND((0.001*VLOOKUP(B18,Sichtfeld!$A$29:$Y$124,9,FALSE)),3)","v":0.29199999999999998},null,5.7480345999999995,11.496069199999999]
[null,190,{"$f":"ROUND((0.001*VLOOKUP(B19,Sichtfeld!$A$29:$Y$124,8,FALSE)),3)","v":0.153},{"$f":"ROUND((0.001*VLOOKUP(B19,Sichtfeld!$A$29:$Y$124,9,FALSE)),3)","v":0.307},null,6.0236253,12.086620699999999]
[null,200,{"$f":"ROUND((0.001*VLOOKUP(B20,Sichtfeld!$A$29:$Y$124,8,FALSE)),3)","v":0.161},{"$f":"ROUND((0.001*VLOOKUP(B20,Sichtfeld!$A$29:$Y$124,9,FALSE)),3)","v":0.32200000000000001},null,6.3385861000000006,12.677172200000001]
{"$rows_left_out":94}
{"sheet":"Schärfentiefe","index":5,"n_rows":154,"n_cols":29,"rows_kept":154,"cut":false,"hidden":true,"merged":[[20,27,20,28],[20,6,20,7],[20,15,20,16],[20,25,20,26],[20,8,20,9],[20,17,20,18]]}
[{"$f":"Sichtfeld!A4","v":"Abstand Gehäusefront zu Sensor [mm]"},null,{"$f":"Sichtfeld!C4","v":34},null,"siehe auch \"\\\\emea.baumernet.org\\de04d\\Projekte\\34600180_Plattform_Stage_3\\3_kon\\Autofokus\\Berechnung_Schärfe.xlsx\""]
[{"$f":"Sichtfeld!A5","v":"Sensorbreite [mm]"}]
[{"$f":"Sichtfeld!A6","v":"Sensorhöhe [mm]"}]
[{"$f":"Sichtfeld!A7","v":"Min. Breite Modul 1D-Code [px]"}]
[{"$f":"Sichtfeld!A8","v":"Min. Breite Modul 2D-Code [px]"}]
[]
[{"$f":"Sichtfeld!A10","v":"Hersteller"},null,{"$f":"Sichtfeld!C10","v":"YTOT"},{"$nulls":8},{"$f":"Sichtfeld!K10","v":"YTOT"},{"$nulls":9},{"$f":"Sichtfeld!S10","v":"EVETAR"}]
[{"$f":"Sichtfeld!A11","v":"Objektiv"},null,{"$f":"Sichtfeld!C11","v":"YT1028-2MP"},{"$nulls":8},{"$f":"Sichtfeld!K11","v":"YT10051-2MP"},{"$nulls":9},{"$f":"Sichtfeld!S11","v":"M13B1618IRM12R1"}]
[{"$f":"Sichtfeld!A12","v":"Daten allg."},null,{"$f":"Sichtfeld!C12","v":"\\\\emea.baumernet.org\\de04d\\Projekte\\34600180_Plattform_Stage_3\\3_kon\\01_Optik\\3_Objektive_YTOT\\Datenblätter\\YT1028-2MP.pdf"},{"$nulls":8},{"$f":"Sichtfeld!K12","v":"\\\\emea.baumernet.org\\de04d\\Projekte\\34600180_Plattform_Stage_3\\3_kon\\01_Optik\\3_Objektive_YTOT\\Datenblätter\\YT10051-2MP.pdf"},{"$nulls":9},{"$f":"Sichtfeld!S12","v":" "}]
[{"$f":"Sichtfeld!A13","v":"Daten H1/H2"},null,{"$f":"Sichtfeld!C13","v":"\\\\emea.baumernet.org\\de04d\\Projekte\\34600180_Plattform_Stage_3\\3_kon\\01_Optik\\3_Objektive_YTOT\\Datenblätter\\YT10028_H1H2.pdf"},{"$nulls":8},{"$f":"Sichtfeld!K13","v":"\\\\emea.baumernet.org\\de04d\\Projekte\\34600180_Plattform_Stage_3\\3_kon\\01_Optik\\3_Objektive_YTOT\\Datenblätter\\YT10051_H1H2.pdf"},{"$nulls":9},{"$f":"Sichtfeld!S13","v":"\\\\emea.baumernet.org\\de04d\\Projekte\\34600180_Plattform_Stage_3\\3_kon\\01_Optik\\2_Objektive_Evetar\\Datenblätter\\16mmF1,8_11162414.pdf"}]
[{"$f":"Sichtfeld!A14","v":"Brennweite f [mm]"},null,{"$f":"Sichtfeld!C14","v":6},{"$nulls":8},{"$f":"Sichtfeld!K14","v":8},{"$nulls":9},{"$f":"Sichtfeld!S14","v":16}]
["Blende",null,3.5,{"$nulls":8},3.5,{"$nulls":9},1.8]
["ø Zerstreuungskreis Code lesen [µm]",null,9,{"$nulls":8},9,{"$nulls":9},9]
[{"$f":"Sichtfeld!A15","v":"Hauptebene 1 [mm]"},null,{"$f":"Sichtfeld!C15","v":9.02},{"$nulls":8},{"$f":"Sichtfeld!K15","v":8.2799999999999976},{"$nulls":9},{"$f":"Sichtfeld!S15","v":5.8500000000000014}]
[{"$f":"Sichtfeld!A16","v":"Hauptebene 2 [mm]"},null,{"$f":"Sichtfeld!C16","v":16.37},{"$nulls":8},{"$f":"Sichtfeld!K16","v":14.109999999999998},{"$nulls":9},{"$f":"Sichtfeld!S16","v":9.67}]
[{"$f":"Sichtfeld!A17","v":"Bildebene [mm]"},null,{"$f":"Sichtfeld!C17","v":22.2},{"$nulls":8},{"$f":"Sichtfeld!K17","v":22.2},{"$nulls":9},{"$f":"Sichtfeld!S17","v":22.14}]
[{"$f":"Sichtfeld!A18","v":"Position Front Objektiv bei unendlich"},null,{"$f":"Sichtfeld!C18","v":22.2},{"$nulls":8},{"$f":"Sichtfeld!K18","v":22.2},{"$nulls":9},{"$f":"Sichtfeld!S18","v":22.14}]
[{"$f":"Sichtfeld!A19","v":"Abstand Gehäusefront zu H1 bei unendlich => g_i [mm]"},null,{"$f":"Sichtfeld!C19","v":20.82},{"$nulls":8},{"$f":"Sichtfeld!K19","v":20.079999999999998},{"$nulls":9},{"$f":"Sichtfeld!S19","v":17.71}]
[{"$f":"Sichtfeld!A20","v":"x_max [mm]"},null,{"$f":"Sichtfeld!C20","v":2.6},{"$nulls":8},{"$f":"Sichtfeld!K20","v":2.6},{"$nulls":9},{"$f":"Sichtfeld!S20","v":2.6}]
[]
{"$rows_left_out":106}
{"sheet":"Daten Gesamt","index":6,"n_rows":13,"n_cols":7,"rows_kept":13,"cut":false,"hidden":true,"merged":[[2,1,2,2],[0,1,0,2],[0,3,0,4],[2,3,2,4],[0,5,0,6],[2,5,2,6],[5,1,5,2],[5,3,5,4],[5,5,5,6],[8,1,8,2],[8,3,8,4],[8,5,8,6]]}
["Gerät","IDC200.W06",null,"IDC200.W08",null,"IDC200.W16"]
["Wertebereich (Nutzabstand)",50,1000,50,1000,100,1000]
["Bereich","Bildfeld",null,"Bildfeld",null,"Bildfeld"]
["Bereich x/ y","Bildfeld x in mm","Bildfeld y in mm","Bildfeld x in mm","Bildfeld y in mm","Bildfeld x in mm","Bildfeld y in mm"]
["Funktion","y = 0.6395x + 9.4062","y = 0.4x + 6","y = 0.4807x + 5.4607","y = 0.301x + 3.4154","y = 0.2399x + 0.0592","y = 0.1502x + 0.0912"]
["Bereich","Modulgrösse",null,"Modulgrösse",null,"Modulgrösse"]
["Bereich 1D / 2D","1D","2D","1D","2D","1D","2D"]
["Funktion","y = 0.0008x + 0.0108","y = 0.0015x + 0.0219","y = 0.0006x + 0.0065","y = 0.0011x + 0.0129","y = 0.0003x + 3E-05","y = 0.0006x - 8E-05"]
["Bereich","Schärfentiefe",null,"Schärfentiefe",null,"Schärfentiefe"]
["Bereich nah/fern","nah","fern","nah","fern","nah","fern"]
["Funktion","y = -0.0003x2 + 0.7875x + 15.973",null,null,null,"y = -0.0057x2 + 9.9606x - 9.5868","y = 0.0071x2 + 9.9734x - 9.5555"]
[]
["Fixwerte"]

{"sheet":"IDC Sichtfeldrechner","index":7,"n_rows":100,"n_cols":11,"rows_kept":100,"cut":false,"hidden":false,"merged":[[21,4,21,5],[21,6,21,7],[31,6,31,7],[22,6,22,7],[29,4,29,5],[29,6,29,7],[22,2,22,3],[22,4,22,5],[31,2,31,3],[29,2,29,3],[31,4,31,5],[8,4,8,6],[5,5,5,6],[13,10,13,11],[14,10,14,11],[15,10,15,11]]}
[]
[null,null,null,"IDC Sichtfeldrechner"]
[]
[]
[]
[null,{"$f":"IF(K18=1,\"IDC200.W06\",IF(K18=2,\"IDC200.W08\",\"IDC200.W16\"))","v":"IDC200.W08"},null,null,null,"Leseabstand eingeben:",null,500]
[]
[null,null,"Leseabstand"]
[null,null,{"$f":"H6","v":500},null,"Modulgrösse eingeben (optional):"]
[{"$nulls":7},{"$f":"IF(ISNUMBER(H9),H9*39.37,\"\")","v":""}]
[null,"Sichtfeldbreite"]
[null,{"$f":"IF(K18=1,$C$24,IF(K18=2,$E$24,IF(K18=3,$G$24,\"\")))","v":245.73839472481109}]
[]
[]
[]
[null,"Sichtfeldhöhe"]
[null,{"$f":"IF(K18=1,$D$24,IF(K18=2,$F$24,IF(K18=3,$H$24,\"\")))","v":153.58649670300693}]
[{"$nulls":10},2]
[]
[]
{"$rows_left_out":64}
{"sheet":"IDC FoV Calculator English","index":8,"n_rows":95,"n_cols":9,"rows_kept":95,"cut":false,"hidden":true,"merged":[[1,11,1,12],[14,1,14,2],[14,3,14,4],[14,5,14,6],[15,1,15,2],[15,3,15,4],[15,5,15,6],[16,1,16,2],[16,3,16,4],[16,5,16,6],[17,1,17,2],[17,3,17,4],[17,5,17,6],[24,1,24,2],[24,3,24,4],[24,5,24,6],[26,1,26,2],[26,3,26,4],[26,5,26,6]]}
["Field of View Calculator"]
[]
[{"$f":"IF(B16=1,\"IDC200.W06\",IF(B16=2,\"IDC200.W08\",\"IDC200.W16\"))","v":"IDC200.W16"},{"$nulls":4},"Type in reading distance:",null,500]
[]
[]
[null,{"$f":"H3","v":500}]
[]
["FoV Width",{"$nulls":4},"Type in module size:",null,null,"[mm]"]
[{"$f":"IF($B$16=1,$B$19,IF($B$16=2,$D$19,IF($B$16=3,$F$19,\"\")))","v":120.28781401636911},{"$nulls":6},{"$f":"IF(ISNUMBER(H8),H8*39.37,\"\")","v":""},"[mil]"]
[]
[]
[]
["FoV Height"]
[{"$f":"IF($B$16=1,$C$19,IF($B$16=2,$E$19,IF($B$16=3,$G$19,\"\")))","v":75.179883760230695}]
[null,"Link Website - W06",null,"Link Website - W08",null,"Link Website - W16"]
[null,3,2,false,null,false]
["Results"]
["reading distance [mm]",{"$f":"H3","v":500},null,{"$f":"H3","v":500},null,{"$f":"H3","v":500}]
["Field of view x*y [mm]",{"$f":"IF(ISNUMBER(B66),$B$51/B66,\"\")","v":329.44004041345568},{"$f":"IF(ISNUMBER(B66),$B$52/B66,\"\")","v":205.90002525840981},{"$f":"IF(ISNUMBER(D66),$B$51/D66,\"\")","v":245.73839472481109},{"$f":"IF(ISNUMBER(D66),$B$52/D66,\"\")","v":153.58649670300693},{"$f":"IF(ISNUMBER(F66),$B$51/F66,\"\")","v":120.28781401636911},{"$f":"IF(ISNUMBER(F66),$B$52/F66,\"\")","v":75.179883760230695}]
["depth of field from…to [mm] until max. 1.5m",{"$f":"$H$3*$B$94+$H$3","v":336.99239382468005},{"$f":"IF(($H$3*$B$95+$H$3)>1500,1500,$H$3*$B$95+$H$3)","v":935.90667444664723},{"$f":"$H$3*$D$94+$H$3","v":394.04981680953023},{"$f":"IF(($H$3*$D$95+$H$3)>1500,1500,$H$3*$D$95+$H$3)","v":678.829734370653},{"$f":"IF(ISNUMBER(F94),$H$3*$F$94+$H$3,\"\")","v":483.60903956525743},{"$f":"IF(ISNUMBER(F95),$H$3*$F$95+$H$3,\"\")","v":517.50018416248588}]
{"$rows_left_out":59}
{"sheet":"Kalkulator","index":9,"n_rows":94,"n_cols":8,"rows_kept":94,"cut":false,"hidden":true,"merged":[[32,0,35,0],[15,1,15,2],[15,3,15,4],[15,5,15,6],[32,1,33,1],[16,1,16,2],[16,3,16,4],[16,5,16,6],[17,1,17,2],[17,3,17,4],[17,5,17,6],[24,1,24,2],[24,3,24,4],[24,5,24,6]]}
["Sichtfeldrechner"]
[]
[{"$nulls":5},"Leseabstand eingeben:",null,10]
[]
[]
[]
[]
["Sichtfeldbreite",{"$f":"H3","v":10},null,null,null,"Modulgrösse eingeben:",null,200]
[{"$f":"IF($B$16=1,$B$19,IF($B$16=2,$D$19,IF($B$16=3,$F$19,\"\")))","v":""}]
[]
[]
[]
["Sichtfeldhöhe"]
[{"$f":"IF($B$16=1,$C$19,IF($B$16=2,$E$19,IF($B$16=3,$G$19,\"\")))","v":""}]
[]
[null,3,2,false,null,false]
["Ergebnisse",{"$nulls":6},"wenn ganze Spalte beim jew. IDC grün, dann ist IDC geeignet"]
["Leseabstand [mm]",{"$f":"H3","v":10},null,{"$f":"H3","v":10},null,{"$f":"H3","v":10}]
["Sichtfeld x*y [mm]",{"$f":"IF(ISNUMBER(B65),$B$50/B65,\"\")","v":14.894818123214398},{"$f":"IF(ISNUMBER(B65),$B$51/B65,\"\")","v":9.3092613270089988},{"$f":"IF(ISNUMBER(D65),$B$50/D65,\"\")","v":""},{"$f":"IF(ISNUMBER(D65),$B$51/D65,\"\")","v":""},{"$f":"IF(ISNUMBER(F65),$B$50/F65,\"\")","v":""},{"$f":"IF(ISNUMBER(F65),$B$51/F65,\"\")","v":""}]
["Tiefenscharfe von…bis [mm] bis max. 1.5m",{"$f":"$H$3*$B$93+$H$3","v":9.2689229960629902},{"$f":"IF(($H$3*$B$94+$H$3)>1500,1500,$H$3*$B$94+$H$3)","v":10.769513133450712},{"$f":"$H$3*$D$93+$H$3","v":{"$error":"#VALUE!"}},{"$f":"IF(($H$3*$D$94+$H$3)>1500,1500,$H$3*$D$94+$H$3)","v":{"$error":"#VALUE!"}},{"$f":"IF(ISNUMBER(F93),$H$3*$F$93+$H$3,\"\")","v":""},{"$f":"IF(ISNUMBER(F94),$H$3*$F$94+$H$3,\"\")","v":""}]
{"$rows_left_out":66}